{"text_format":"1","workbook":"xlsx","n_sheets":9,"sheets":["Read Me","Instructions","CFP Quantification","3.1.1 Lime Production & Flaring","Customized Embodied EF","Customized Process Factors","Customized Fuel EF","Customized Fuel LHV","Default EF&LHV References "],"not_rendered":{"charts":0,"images":1,"macros":1,"external_links":0,"defined_names":137,"comments":3,"pivot_tables":0},"unopened":[],"bounds":{"document_bytes":16777216,"sheet_cells":100000,"rows_first":2000,"rows_last":500,"rows_between":2000,"halvings":0,"cell_chars":16384,"cell_head_chars":4096},"cells_cut":0,"cells_raw":0,"read":"whole","date_system":"1900"}

{"sheet":"Read Me","index":0,"n_rows":40,"n_cols":4,"rows_kept":40,"cut":false,"hidden":false,"merged":[[24,1,24,7],[21,1,21,7],[22,1,22,7],[23,1,23,7],[0,1,0,7],[2,1,2,7],[6,3,6,6],[18,1,18,7],[19,1,19,7],[20,1,20,7]]}
[null,"CFP Quantification Tool - Reinforcing Bar & Structural Steel"]
[]
[null,"Colour Codes, Notes & FAQ"]
[]
[]
[null,"Tool Sections :"]
[null,"G : General Information Section ","=","General information of the certifying Reinforcing Bar & Structural Steel product(s) that required user input"]
[null,"A : Assessment Section","=","Calculation of the carbon emission for each Reinforcing Bar & Structural Steel product"]
[null,"P : Performance Section ","=","Summary of each of the Reinforcing Bar & Structural Steel Carbon emission performance "]
[]
[null,"Colour Code of Cells :",null,"Colour Code of Sheets :"]
[null,"Input cell",null,"Instruction"]
[null,"Calculated value",null,"Calculation Tool"]
[null,"Information ( Title , units, item nos. etc)",null," Factor for Calculation"]
[null,"Not used ",null,"Default Factor References"]
{"$rows_left_out":26}
{"sheet":"Instructions","index":1,"n_rows":207,"n_cols":18,"rows_kept":207,"cut":false,"hidden":false,"merged":[[106,5,107,6],[108,5,109,6],[110,5,111,6],[0,0,0,17],[2,8,2,9],[3,8,3,9],[5,1,6,1],[5,2,6,17],[7,1,18,1],[7,2,7,9],[7,10,7,17],[8,5,8,9],[13,10,18,17],[13,6,18,9],[12,5,12,9],[12,10,12,17],[9,5,9,9],[10,5,10,9],[11,5,11,9],[8,10,10,17],[11,10,11,17],[26,5,26,7],[26,8,26,9],[27,1,29,1],[19,1,26,1],[19,2,19,17],[20,5,20,7],[20,8,20,9],[21,5,21,7],[21,8,21,9],[38,10,38,11],[39,10,39,11],[40,5,40,6],[27,2,27,8],[27,10,27,11],[28,10,28,11],[29,10,29,11],[20,10,26,17],[28,12,28,17],[24,5,24,7],[24,8,24,9],[25,5,25,7],[25,8,25,9],[22,5,22,7],[22,8,22,9],[23,5,23,7],[23,8,23,9],[41,10,41,11],[42,10,42,11],[43,10,43,11],[30,1,49,1],[30,2,30,8],[30,10,30,11],[31,10,31,11],[32,10,32,11],[33,10,33,11],[34,10,34,11],[35,10,35,11],[36,10,36,11],[37,10,37,11],[38,5,39,5],[52,12,52,17],[53,1,96,1],[53,2,53,8],[53,10,53,11],[55,5,55,6],[44,5,44,6],[45,5,45,6],[46,5,46,6],[50,1,52,1],[50,2,50,8],[50,10,50,11],[51,10,51,11],[52,10,52,11],[72,5,72,6],[76,5,76,6],[73,10,74,11],[68,10,71,11],[68,5,71,6],[62,5,62,6],[67,5,67,6],[63,10,65,11],[56,10,61,11],[57,5,61,6],[90,5,90,6],[91,5,91,6],[92,5,92,6],[93,5,93,6],[91,10,94,11],[85,5,85,6],[77,10,84,11],[86,10,88,11],[77,5,84,6],[101,5,101,8],[101,10,101,11],[102,2,102,3],[102,5,102,6],[102,7,102,8],[103,10,103,11],[94,5,94,6],[96,10,96,11],[97,1,97,17],[98,2,98,17],[99,1,120,1],[99,2,99,17],[100,2,100,8],[100,10,100,11],[101,2,101,3],[113,2,113,3],[113,5,113,6],[113,7,113,8],[114,10,114,11],[115,10,115,11],[110,10,110,11],[111,10,111,11],[112,2,112,3],[112,5,112,8],[112,10,112,11],[110,7,111,7],[107,10,107,11],[108,10,108,11],[109,10,109,11],[104,10,104,11],[105,10,105,11],[106,10,106,11],[121,1,125,1],[121,2,121,17],[122,2,122,8],[122,10,122,11],[123,2,123,3],[116,10,116,11],[117,10,117,11],[118,10,118,11],[114,5,119,6],[114,8,119,8],[123,5,123,8],[124,5,124,8],[124,10,124,11],[125,2,125,3],[125,5,125,7],[125,10,125,11],[119,10,119,11],[103,5,105,6],[126,1,189,1],[126,2,126,17],[127,2,127,8],[127,10,127,11],[128,2,128,3],[128,5,128,8],[128,10,128,11],[129,10,129,11],[135,10,135,11],[136,10,136,11],[137,10,137,11],[133,5,137,6],[132,7,137,7],[130,5,130,6],[131,5,131,6],[132,10,132,11],[133,10,133,11],[134,10,134,11],[144,5,144,6],[138,5,138,6],[139,10,139,11],[140,10,140,11],[141,10,141,11],[142,10,142,11],[143,5,143,6],[139,7,141,7],[120,2,120,3],[120,5,120,7],[120,10,120,11],[153,5,153,6],[154,5,154,6],[155,10,155,11],[156,10,156,11],[148,10,148,11],[149,5,149,6],[150,10,150,11],[151,10,151,11],[152,10,152,11],[145,7,148,7],[145,5,148,6],[145,10,145,11],[146,10,146,11],[147,10,147,11],[164,10,164,11],[165,10,165,11],[166,10,166,11],[167,10,167,11],[168,5,168,6],[160,10,160,11],[161,10,161,11],[162,10,162,11],[157,10,157,11],[158,10,158,11],[159,10,159,11],[183,2,183,3],[183,5,183,8],[183,10,183,11],[184,7,184,8],[181,5,182,5],[181,6,182,6],[181,7,182,8],[178,10,178,11],[179,2,179,3],[179,5,179,8],[179,10,179,11],[180,7,180,8],[181,10,181,11],[188,2,188,3],[188,5,188,8],[188,10,188,11],[189,2,189,3],[189,5,189,7],[189,10,189,11],[185,10,185,11],[186,10,186,11],[187,2,187,3],[187,5,187,8],[187,10,187,11],[185,5,186,5],[185,6,186,6],[185,7,186,8],[194,5,194,7],[194,10,194,11],[196,2,196,8],[196,10,196,11],[197,1,206,1],[197,10,197,11],[198,5,198,8],[198,10,198,11],[199,5,199,8],[199,10,199,11],[190,1,194,1],[190,2,190,17],[191,2,191,8],[191,10,191,11],[192,2,192,3],[192,5,192,8],[192,10,192,17],[193,5,193,8],[193,10,193,11],[194,2,194,3],[204,5,204,8],[204,10,204,11],[205,5,205,8],[205,10,205,11],[206,5,206,8],[206,10,206,11],[200,5,200,8],[200,10,200,11],[201,5,201,8],[201,10,201,11],[202,10,202,11],[203,5,203,8],[203,10,203,11],[193,12,193,17],[124,12,124,17],[155,5,162,6],[155,7,162,7],[164,7,166,7],[170,5,173,6],[170,7,173,7],[31,12,39,17],[41,8,43,8],[45,8,46,8],[48,8,49,8],[45,10,46,10],[48,12,49,17],[182,10,182,11],[173,10,173,11],[174,5,174,6],[175,10,175,11],[176,10,176,11],[177,10,177,11],[169,5,169,6],[170,10,170,11],[171,10,171,11],[172,10,172,11],[163,5,163,6]]}
["CFP Quantification -  Reinforcing Bar & Structural Steel"]
["Product category 1: Reinforcing bar "]
["Product category 2: Structural steel  ","Date of latest update",null,null,null,null,null,null,"2025-03-24"]
[null,"Reporting period",null,null,null,null,null,null,"Please provide corresponding information"]
[]
[null,"G","GENERAL INFORMATION"]
[]
[null,"G1","G1 General Plant Information",null,null,null,null,null,null,null,"Description"]
[null,null,{"$f":"LEFT($C$8,2)&\".\"","v":"G1."},1,null,"Plant"]
[null,null,"G1.",2,null,"Company"]
[null,null,"G1.",3,null,"Country / Region"]
[null,null,"G1.",4,null,"Steel product route: \n  (i) BF-BOF; \n  (ii) Scraped-based EAF; \n  (iii) DRI-EAF; \n  (iv) Other [please specify]",null,null,null,null,"Please provide product route for the product(s)."]
[null,null,"G1.",5,null,"Recycling content",null,null,null,null,"Please provide recycling content of the product(s)"]
[null,null,"G1.",6,null,"Product 1","Please select product category:\n1) Product category 1: Reinforcing bar\n2) Product category 2: Structural steel  ",null,null,null,"Please provide corresponding product information (name, strength grade, etc.) to be applied under this category.\nExample: Grade 500B Steel Reinforcing Bar"]
[null,null,"G1.",7,null,"Product 2"]
{"$rows_left_out":193}
{"sheet":"CFP Quantification","index":2,"n_rows":207,"n_cols":18,"rows_kept":207,"cut":false,"hidden":false,"merged":[[9,5,9,9],[10,5,10,9],[11,5,11,9],[0,0,0,17],[2,8,2,9],[3,8,3,9],[5,1,6,1],[5,2,6,17],[7,1,18,1],[7,2,7,9],[7,10,7,17],[8,5,8,9],[8,10,8,17],[9,10,9,17],[10,10,10,17],[13,10,13,17],[11,10,11,13],[11,14,11,17],[13,6,13,9],[14,6,14,9],[15,6,15,9],[12,5,12,9],[12,10,12,17],[16,6,16,9],[27,1,29,1],[27,2,27,8],[22,8,22,9],[22,10,22,17],[23,8,23,9],[23,10,23,17],[24,8,24,9],[24,10,24,17],[19,1,26,1],[19,2,19,17],[20,8,20,9],[20,10,20,17],[21,8,21,9],[21,10,21,17],[20,5,20,7],[21,5,21,7],[22,5,22,7],[23,5,23,7],[24,5,24,7],[26,5,26,7],[28,10,28,11],[27,10,27,11],[50,1,52,1],[61,10,61,11],[63,10,63,11],[64,10,64,11],[71,10,71,11],[77,10,77,11],[78,10,78,11],[79,10,79,11],[29,10,29,11],[30,1,49,1],[53,2,53,8],[53,10,53,11],[30,2,30,8],[30,10,30,11],[37,10,37,11],[38,10,38,11],[40,5,40,6],[61,5,61,6],[55,5,55,6],[62,5,62,6],[67,5,67,6],[68,5,68,6],[45,5,45,6],[46,5,46,6],[101,2,101,3],[101,5,101,8],[101,10,101,11],[102,2,102,3],[102,5,102,6],[102,7,102,8],[97,1,97,17],[98,2,98,17],[99,1,120,1],[99,2,99,17],[100,2,100,8],[100,10,100,11],[114,5,114,6],[114,10,114,11],[119,5,119,6],[119,10,119,11],[120,5,120,7],[109,5,109,6],[109,10,109,11],[110,5,110,6],[110,10,110,11],[117,5,117,6],[112,5,112,8],[112,10,112,11],[128,2,128,3],[128,10,128,11],[126,1,189,1],[126,2,126,17],[127,2,127,8],[127,10,127,11],[123,2,123,3],[123,5,123,8],[121,1,125,1],[121,2,121,17],[122,2,122,8],[122,10,122,11],[183,2,183,3],[183,5,183,8],[183,10,183,11],[179,2,179,3],[179,5,179,8],[162,10,162,11],[167,10,167,11],[176,10,176,11],[124,5,124,8],[124,10,124,11],[146,10,146,11],[147,10,147,11],[190,1,194,1],[190,2,190,17],[191,2,191,8],[191,10,191,11],[193,5,193,8],[193,10,193,11],[125,2,125,3],[125,5,125,7],[125,10,125,11],[188,2,188,3],[188,5,188,8],[188,10,188,11],[189,2,189,3],[189,5,189,7],[189,10,189,11],[184,7,184,8],[185,7,185,8],[185,10,185,11],[186,7,186,8],[186,10,186,11],[187,2,187,3],[187,5,187,8],[187,10,187,11],[180,7,180,8],[194,2,194,3],[194,5,194,7],[194,10,194,11],[196,2,196,8],[196,10,196,11],[192,2,192,3],[192,5,192,8],[206,5,206,8],[206,10,206,11],[200,10,200,11],[192,10,192,17],[197,1,206,1],[197,10,197,11],[198,5,198,8],[198,10,198,11],[199,5,199,8],[199,10,199,11],[200,5,200,8],[204,5,204,8],[204,10,204,11],[205,5,205,8],[205,10,205,11],[201,5,201,8],[201,10,201,11],[202,10,202,11],[203,5,203,8],[203,10,203,11],[133,10,133,11],[134,10,134,11],[135,10,135,11],[179,10,179,11],[136,10,136,11],[142,10,142,11],[145,10,145,11],[148,10,148,11],[141,10,141,11],[181,7,181,8],[181,10,181,11],[182,7,182,8],[182,10,182,11],[177,10,177,11],[178,10,178,11],[128,5,128,8],[129,10,129,11],[172,5,172,6],[163,5,163,6],[173,5,173,6],[174,5,174,6],[168,5,168,6],[162,5,162,6],[170,5,170,6],[171,5,171,6],[158,5,158,6],[159,5,159,6],[160,5,160,6],[161,5,161,6],[153,5,153,6],[155,5,155,6],[156,5,156,6],[157,5,157,6],[120,2,120,3],[112,2,112,3],[113,2,113,3],[107,5,107,6],[107,10,107,11],[108,5,108,6],[108,10,108,11],[105,5,105,6],[105,10,105,11],[106,5,106,6],[106,10,106,11],[115,5,115,6],[116,5,116,6],[113,5,113,6],[113,7,113,8],[111,5,111,6],[120,10,120,11],[103,5,103,6],[103,10,103,11],[104,5,104,6],[104,10,104,11],[57,5,57,6],[80,10,80,11],[81,10,81,11],[82,10,82,11],[83,10,83,11],[84,10,84,11],[58,5,58,6],[59,5,59,6],[60,5,60,6],[74,10,74,11],[50,2,50,8],[50,10,50,11],[91,10,91,11],[56,10,56,11],[57,10,57,11],[58,10,58,11],[59,10,59,11],[60,10,60,11],[68,10,68,11],[69,10,69,11],[70,10,70,11],[76,5,76,6],[77,5,77,6],[78,5,78,6],[69,5,69,6],[51,10,51,11],[52,10,52,11],[53,1,96,1],[86,10,86,11],[87,10,87,11],[88,10,88,11],[94,10,94,11],[96,10,96,11],[85,5,85,6],[91,5,91,6],[92,5,92,6],[93,5,93,6],[90,5,90,6],[94,5,94,6],[79,5,79,6],[80,5,80,6],[81,5,81,6],[82,5,82,6],[83,5,83,6],[84,5,84,6],[70,5,70,6],[71,5,71,6],[72,5,72,6],[73,10,73,11],[92,10,92,11],[93,10,93,11],[146,5,146,6],[175,10,175,11],[43,10,43,11],[65,10,65,11],[39,10,39,11],[111,10,111,11],[161,10,161,11],[170,10,170,11],[171,10,171,11],[172,10,172,11],[173,10,173,11],[166,10,166,11],[159,10,159,11],[160,10,160,11],[164,10,164,11],[165,10,165,11],[152,10,152,11],[155,10,155,11],[156,10,156,11],[157,10,157,11],[158,10,158,11],[132,10,132,11],[140,10,140,11],[139,10,139,11],[131,5,131,6],[138,5,138,6],[144,5,144,6],[154,5,154,6],[169,5,169,6],[118,5,118,6],[115,10,115,11],[116,10,116,11],[117,10,117,11],[118,10,118,11],[137,10,137,11],[137,5,137,6],[149,5,149,6],[147,5,147,6],[148,5,148,6],[143,5,143,6],[145,5,145,6],[136,5,136,6],[151,10,151,11],[150,10,150,11],[130,5,130,6],[133,5,133,6],[134,5,134,6],[135,5,135,6],[44,5,44,6],[17,6,17,9],[18,6,18,9],[14,10,14,17],[15,10,15,17],[16,10,16,17],[17,10,17,17],[18,10,18,17],[25,5,25,7],[25,8,25,9],[25,10,25,17],[26,8,26,9],[26,10,26,17],[52,12,52,17],[41,10,41,11],[42,10,42,11],[31,10,31,11],[32,10,32,11],[33,10,33,11],[34,10,34,11],[35,10,35,11],[36,10,36,11]]}
["CFP Quantification -  Reinforcing Bar & Structural Steel"]
["Product category 1: Reinforcing bar "]
["Product category 2: Structural steel  ","Date of latest update",null,null,null,null,null,null,"2025-03-24"]
[null,"Reporting period"]
[]
[null,"G","GENERAL INFORMATION"]
[]
[null,"G1","G1 General Plant Information",null,null,null,null,null,null,null,"Description"]
[null,null,{"$f":"LEFT($C$8,2)&\".\"","v":"G1."},1,null,"Plant"]
[null,null,"G1.",2,null,"Company"]
[null,null,"G1.",3,null,"Country / Region"]
[null,null,"G1.",4,null,"Steel product route: \n  (i) BF-BOF; \n  (ii) Scraped-based EAF; \n  (iii) DRI-EAF; \n  (iv) Other [please specify]"]
[null,null,"G1.",5,null,"Recycling content"]
[null,null,"G1.",6,null,"Product 1"]
[null,null,"G1.",7,null,"Product 2"]
{"$rows_left_out":193}
{"sheet":"3.1.1 Lime Production & Flaring","index":3,"n_rows":49,"n_cols":15,"rows_kept":49,"cut":false,"hidden":false,"merged":[[0,0,0,14],[2,5,2,6],[3,5,3,6],[6,4,7,4],[6,5,6,10],[13,2,13,14],[5,2,5,14],[14,4,15,4],[14,5,14,8],[14,9,14,13],[14,14,15,14],[15,7,15,8],[15,9,15,10],[15,11,15,12],[6,11,6,13],[6,14,7,14],[7,7,7,8],[7,9,7,10],[19,9,19,10],[19,11,19,12],[20,3,20,13],[22,4,23,4],[22,5,23,5],[21,2,21,14],[16,9,16,10],[16,11,16,12],[17,9,17,10],[17,11,17,12],[18,9,18,10],[18,11,18,12],[28,3,28,13],[33,1,33,2],[34,1,34,2],[25,12,25,13],[26,12,26,13],[27,12,27,13],[22,6,23,6],[22,7,23,7],[22,12,23,13],[22,11,23,11],[34,13,34,14],[22,14,23,14],[24,12,24,13],[22,1,23,3],[24,1,24,3],[45,1,45,4],[39,11,39,12],[40,11,40,12],[33,11,33,12],[33,3,33,4],[34,11,34,12],[35,11,35,12],[36,11,36,12],[37,11,37,12],[34,3,34,4],[35,3,35,4],[36,3,36,4],[37,3,37,4],[38,3,38,4],[39,3,39,4],[35,1,35,2],[37,1,37,2],[36,1,36,2],[38,1,38,2],[39,1,39,2],[40,1,40,2],[38,11,38,12],[40,3,40,4],[37,5,37,6],[35,13,35,14],[36,13,36,14],[37,13,37,14],[38,13,38,14],[48,13,48,14],[44,11,44,12],[45,11,45,12],[46,11,46,12],[47,11,47,12],[48,11,48,12],[44,13,44,14],[45,13,45,14],[46,13,46,14],[47,13,47,14],[48,1,48,4],[12,3,12,13],[12,1,12,2],[6,1,7,3],[8,1,8,3],[20,1,20,2],[28,1,28,2],[14,1,15,3],[16,1,16,3],[33,5,33,6],[44,1,44,4],[46,1,46,2],[47,1,47,2],[46,3,46,4],[47,3,47,4],[39,13,39,14],[40,13,40,14],[34,5,34,6],[35,5,35,6],[36,5,36,6],[38,5,38,6],[39,5,39,6],[40,5,40,6],[33,13,33,14]]}
["CFP Quantification - Reinforcing Bar & Structural Steel - Industrial Processes Emissions"]
[]
[null,"Date of latest update",null,null,null,"2025-03-24"]
[null,"Reporting period",null,null,null,{"$f":"IF('CFP Quantification'!I4=0,\"\",'CFP Quantification'!I4)","v":""}]
[]
[null,{"$f":"'CFP Quantification'!D177&'CFP Quantification'!E177","v":"A3.1.1.5"},"CO2e from onsite lime production"]
[null,"Item no.",null,null,"Facility","Carbonate Properties",null,null,null,null,null,"Lime Kiln Dust (LKD) Properties",null,null,"CO2e emissions \n(t CO2e)"]
[null,null,null,null,null,"Carbonate","Amount of carbonate used \n(t /reporting period)","Carbonate CO2 Factor",null,"Fraction calcination achieved for carbonate \n(fraction)",null,"Amount of LKD (tonnes/reporting period)","Weight fraction of original carbonate in the LKD (fraction)","Adopted Fraction calcination achieved for LKD"]
[null,"Example",null,null," Facility A","CaCO3",100,"Default",{"$f":"IF(H9=\"Customized\",_xlfn.XLOOKUP($F9,$B:$B,$J:$J),_xlfn.XLOOKUP($F9,$B:$B,$H:$H))","v":0.43970999999999999},"Default",{"$f":"IF(J9=\"Customized\",_xlfn.XLOOKUP($F9,$B:$B,$K:$K),_xlfn.XLOOKUP($F9,$B:$B,$I:$I))","v":1},80,0.9,1,{"$f":"G9*I9*K9-L9*M9*(1-N9)*I9","v":43.970999999999997}]
[null,null,{"$f":"B6","v":"A3.1.1.5"},".1",null,null,null,null,{"$f":"IF(H10=\"Customized\",_xlfn.XLOOKUP($F10,$B:$B,$J:$J),_xlfn.XLOOKUP($F10,$B:$B,$H:$H))","v":0},null,{"$f":"IF(J10=\"Customized\",_xlfn.XLOOKUP($F10,$B:$B,$K:$K),_xlfn.XLOOKUP($F10,$B:$B,$I:$I))","v":0},null,null,null,{"$f":"G10*I10*K10-L10*M10*(1-N10)*I10","v":0}]
[null,null,{"$f":"C10","v":"A3.1.1.5"},".2",null,null,null,null,0,null,0,null,null,null,{"$f":"G11*I11*K11-L11*M11*(1-N11)*I11","v":0}]
[null,null,{"$f":"C11","v":"A3.1.1.5"},".3",null,null,null,null,0,null,0,null,null,null,{"$f":"G12*I12*K12-L12*M12*(1-N12)*I12","v":0}]
[null,{"$f":"C12","v":"A3.1.1.5"},null,"Total",null,null,null,null,null,null,null,null,null,null,{"$f":"SUMIF($C:$C,C10,$O:$O)","v":0}]
[null,{"$f":"'CFP Quantification'!D178&'CFP Quantification'!E178","v":"A3.1.1.6"},"CO2e from offsite lime production"]
[null,"Item no.",null,null,"Facility","Lime Properties",null,null,null,"Correction for hydrated lime",null,null,null,null,"CO2e emissions\n(t CO2e)"]
{"$rows_left_out":35}
{"sheet":"Customized Embodied EF","index":4,"n_rows":21,"n_cols":12,"rows_kept":21,"cut":false,"hidden":false,"merged":[[20,0,20,10],[1,4,1,11],[3,0,11,0],[12,0,18,0]]}
[]
[null,null,null,null,"Customized CO2e Emission Factors for Raw Materials"]
[null,null,null,"Default EF","Product 1","Product 2","Product 3","Product 4","Product 5","Product 6","Supporting document ","Explanation"]
["Raw material ","Dolomite","[t CO2e/ t ]",5.0000000000000001E-3,null,null,null,null,null,null,"Default value is used"]
[null,"Limestone","[t CO2e/ t ]",1.5769999999999999E-2,null,null,null,null,null,null,"Default value is used"]
[null,"Iron ore (lump / fine)","[t CO2e/ t ]",0.02,null,null,null,null,null,null,"Default value is used"]
[null,"Scrap steel","[t CO2e/ t ]","N/A",null,null,null,null,null,null,"Default value is used"]
[null,"Coke","[t CO2e/ t ]","N/A",null,null,null,null,null,null,"Default value is used"]
[null,"Coal","[t CO2e/ t ]",0.29399999999999998,null,null,null,null,null,null,"Default value is used"]
[null,"Coating material","[t CO2e/ t ]",3.028,null,null,null,null,null,null,"Default value is used"]
[null,null,"[t CO2e/ t ]","N/A"]
[null,null,"[t CO2e/ t ]","N/A"]
["Energy Commodity","Diesel oil","[t CO2e/ t ]",0.75202760000000002,null,null,null,null,null,null,"Default value is used"]
[null,"Gasoline","[t CO2e/ t ]",0.81593523000000001,null,null,null,null,null,null,"Default value is used"]
[null,"Petrol coke","[t CO2e/ t ]",0.40262468000000001,null,null,null,null,null,null,"Default value is used"]
{"$rows_left_out":7}
{"sheet":"Customized Process Factors","index":5,"n_rows":111,"n_cols":12,"rows_kept":111,"cut":false,"hidden":false,"merged":[[2,4,2,11],[98,0,98,2],[97,4,97,11],[4,0,29,0],[31,0,52,0],[53,0,69,0],[70,0,72,0],[73,0,77,0],[79,0,91,0],[93,0,93,11],[108,0,110,1],[103,0,103,11],[99,0,99,1],[100,0,100,1],[101,0,101,1]]}
["Table 3 : Default and Customized C Content on Mass Basis for Process Materials"]
[]
[null,null,null,null,"Customized C Content on Mass Basis for Process Materials"]
[null,null,null,"Default Carbon Content","Product 1","Product 2","Product 3","Product 4","Product 5","Product 6","Supporting document ","Explaination"]
["Common Process Materials","Dolomite","[kg C/ kg material ]",0.13,null,null,null,null,null,null,"Default value is used"]
[null,"Limestone","[kg C/ kg material ]",0.12,null,null,null,null,null,null,"Default value is used"]
[null,"Purchased pig iron","[kg C/ kg material ]",0.04,null,null,null,null,null,null,"Default value is used"]
[null,"Scrap iron","[kg C/ kg material ]",0.04,null,null,null,null,null,null,"Default value is used"]
[null,"Iron","[kg C/ kg material ]",0.04,null,null,null,null,null,null,"Default value is used"]
[null,"DRI","[kg C/ kg material ]",0.02,null,null,null,null,null,null,"Default value is used"]
[null,"Hot briquetted iron","[kg C/ kg material ]",0.02,null,null,null,null,null,null,"Default value is used"]
[null,"Steel","[kg C/ kg material ]",0.01,null,null,null,null,null,null,"Default value is used"]
[null,"EAF carbon electrodes","[kg C/ kg material ]",0.82199999999999995,null,null,null,null,null,null,"Default value is used"]
[null,"EAF charge carbon","[kg C/ kg material ]",0.83299999999999996,null,null,null,null,null,null,"Default value is used"]
[null,"Natural gas","[kg C/ kg material ]",{"$f":"_xlfn.XLOOKUP(B15,$B$32:$B$92,$D$32:$D$92)","v":0.73440000000000005},null,null,null,null,null,null,"Default value is used"]
{"$rows_left_out":97}
{"sheet":"Customized Fuel EF","index":6,"n_rows":66,"n_cols":12,"rows_kept":66,"cut":false,"hidden":false,"merged":[[65,0,65,11],[1,4,1,11],[3,0,24,0],[25,0,41,0],[42,0,44,0],[45,0,49,0],[51,0,63,0]]}
[]
[null,null,null,null,"Customized CO2e Direct Emission Factors for Fuel"]
[null,null,null,"Default EF","Product 1","Product 2","Product 3","Product 4","Product 5","Product 6","Supporting document ","Explanation"]
["Crude oil and derived substances","Crude oil","[kg CO2e/ GJ ]",73.303600000000003,null,null,null,null,null,null,"Default value is used"]
[null,"Orimulsion","[kg CO2e/ GJ ]",77.003600000000006,null,null,null,null,null,null,"Default value is used"]
[null,"Natural gas liquids","[kg CO2e/ GJ ]",64.203599999999994,null,null,null,null,null,null,"Default value is used"]
[null,"Gasoline","[kg CO2e/ GJ ]",69.303600000000003,null,null,null,null,null,null,"Default value is used"]
[null,"Jet kerosene","[kg CO2e/ GJ ]",71.503600000000006,null,null,null,null,null,null,"Default value is used"]
[null,"Other kerosene","[kg CO2e/ GJ ]",71.903600000000012,null,null,null,null,null,null,"Default value is used"]
[null,"Shale oil","[kg CO2e/ GJ ]",73.303600000000003,null,null,null,null,null,null,"Default value is used"]
[null,"Diesel oil","[kg CO2e/ GJ ]",74.1036,null,null,null,null,null,null,"Default value is used"]
[null,"Residual fuel oil","[kg CO2e/ GJ ]",77.403600000000012,null,null,null,null,null,null,"Default value is used"]
[null,"Liquified petroleum gases","[kg CO2e/ GJ ]",63.101099999999995,null,null,null,null,null,null,"Default value is used"]
[null,"Ethane","[kg CO2e/ GJ ]",61.601099999999995,null,null,null,null,null,null,"Default value is used"]
[null,"Naphtha","[kg CO2e/ GJ ]",73.303600000000003,null,null,null,null,null,null,"Default value is used"]
{"$rows_left_out":52}
{"sheet":"Customized Fuel LHV","index":7,"n_rows":66,"n_cols":12,"rows_kept":66,"cut":false,"hidden":false,"merged":[[65,0,65,11],[51,0,63,0],[1,4,1,11],[3,0,24,0],[25,0,41,0],[42,0,44,0],[45,0,49,0]]}
[]
[null,null,null,null,"Customized LHVs for Fuel"]
[null,null,null,"Default LHV","Product 1","Product 2","Product 3","Product 4","Product 5","Product 6","Supporting document ","Explanation"]
["Crude oil and derived substances","Crude oil","MJ/kg",42.3,null,null,null,null,null,null,"Default value is used"]
[null,"Orimulsion","MJ/kg",27.5,null,null,null,null,null,null,"Default value is used"]
[null,"Natural gas liquids","MJ/kg",44.2,null,null,null,null,null,null,"Default value is used"]
[null,"Gasoline","MJ/kg",44.3,null,null,null,null,null,null,"Default value is used"]
[null,"Jet kerosene","MJ/kg",44.1,null,null,null,null,null,null,"Default value is used"]
[null,"Other kerosene","MJ/kg",43.8,null,null,null,null,null,null,"Default value is used"]
[null,"Shale oil","MJ/kg",38.1,null,null,null,null,null,null,"Default value is used"]
[null,"Diesel oil","MJ/kg",43,null,null,null,null,null,null,"Default value is used"]
[null,"Residual fuel oil","MJ/kg",40.4,null,null,null,null,null,null,"Default value is used"]
[null,"Liquified petroleum gases","MJ/kg",47.3,null,null,null,null,null,null,"Default value is used"]
[null,"Ethane","MJ/kg",46.4,null,null,null,null,null,null,"Default value is used"]
[null,"Naphtha","MJ/kg",44.5,null,null,null,null,null,null,"Default value is used"]
{"$rows_left_out":52}
{"sheet":"Default EF&LHV References ","index":8,"n_rows":61,"n_cols":3,"rows_kept":61,"cut":false,"hidden":false,"merged":[[32,0,32,2],[36,0,36,2],[40,0,40,2],[51,0,51,2],[0,0,0,1],[1,0,1,2],[13,0,13,2],[17,0,17,2],[21,0,21,2]]}
["Date of latest update",null,"2025-03-24"]
["Default CO2e Emission Factors for Raw Materials"]
["Item","Category","References"]
["/","Raw materials","various"]
[1,"Dolomite","World Steel Association (2021). Life cycle inventory (LCI) study 2020 data release. Available from: https://worldsteel.org/wp-content/uploads/Life-cycle-inventory-LCI-study-2020-data-release.pdf"]
[2,"Limestone","ICE Cement, Mortar and Concrete Model – V1.2 (2024)"]
[3,"Iron ore (lump / fine)","World Steel Association (2021). Life cycle inventory (LCI) study 2020 data release. Available from: https://worldsteel.org/wp-content/uploads/Life-cycle-inventory-LCI-study-2020-data-release.pdf"]
[4,"Scrap steel","N/A"]
[5,"Coke","World Steel Association (2021). Life cycle inventory (LCI) study 2020 data release. Available from: https://worldsteel.org/wp-content/uploads/Life-cycle-inventory-LCI-study-2020-data-release.pdf"]
[6,"Coal","World Steel Association (2021). Life cycle inventory (LCI) study 2020 data release. Available from: https://worldsteel.org/wp-content/uploads/Life-cycle-inventory-LCI-study-2020-data-release.pdf"]
[7,"Coating material","World Steel Association (2021). Life cycle inventory (LCI) study 2020 data release. Default of \"Paint (PVDF, acrylic)\" is used.\nAvailable from: https://worldsteel.org/wp-content/uploads/Life-cycle-inventory-LCI-study-2020-data-release.pdf"]
["/","Energy commodity","UK Department for Energy Security and Net Zero (2024). Greenhouse gas reporting: conversion factors 2024."]
[]
["(Table 1) Carbonate-specific emission factors used in onsite lime production"]
["Item","Category","References"]
{"$rows_left_out":46}